{"text_format":"1","workbook":"xlsx","n_sheets":5,"sheets":["Mais-valia","Tabelas IRS","Coeficiente de atualização","Art 13 CIMT","Backup"],"not_rendered":{"charts":0,"images":0,"macros":1,"external_links":0,"defined_names":2,"comments":1,"pivot_tables":0},"unopened":[],"bounds":{"document_bytes":16777216,"sheet_cells":100000,"rows_first":2000,"rows_last":500,"rows_between":2000,"halvings":0,"cell_chars":16384,"cell_head_chars":4096},"cells_cut":0,"cells_raw":0,"read":"whole","date_system":"1900"}

{"sheet":"Mais-valia","index":0,"n_rows":129,"n_cols":31,"rows_kept":129,"cut":false,"hidden":false,"merged":[[110,0,113,0],[125,0,128,0],[83,1,83,2],[83,3,83,4],[94,1,94,2],[94,3,94,4],[100,1,100,2],[100,3,100,4],[107,1,107,2],[107,3,107,4],[117,1,117,2],[117,3,117,4],[123,1,123,2],[123,3,123,4],[106,0,106,16383],[117,5,117,6],[123,5,123,6],[94,5,94,6],[100,5,100,6],[107,5,107,6],[123,7,123,8],[94,9,94,10],[100,9,100,10],[107,9,107,10],[46,5,46,6],[52,5,52,6],[59,5,59,6],[70,5,70,6],[52,11,52,12],[78,0,81,0],[39,0,42,0],[63,0,66,0],[87,0,90,0],[82,0,82,16383],[59,11,59,12],[59,7,59,8],[76,5,76,6],[83,5,83,6],[52,9,52,10],[59,9,59,10],[70,9,70,10],[76,9,76,10],[83,9,83,10],[70,11,70,12],[83,15,83,16],[83,19,83,20],[70,23,70,24],[76,23,76,24],[28,11,28,12],[35,17,35,18],[46,17,46,18],[12,23,12,24],[23,23,23,24],[129,0,129,16383],[76,1,76,2],[59,3,59,4],[76,3,76,4],[28,1,28,2],[28,3,28,4],[23,1,23,2],[23,3,23,4],[23,5,23,6],[28,5,28,6],[35,5,35,6],[46,1,46,2],[46,3,46,4],[70,1,70,2],[70,3,70,4],[35,1,35,2],[35,3,35,4],[59,1,59,2],[58,0,58,16383],[1,1,1,2],[12,1,12,2],[12,3,12,4],[4,1,4,2],[12,5,12,6],[11,0,11,16383],[34,0,34,16383],[52,1,52,2],[52,3,52,4],[52,17,52,18],[16,0,19,0],[12,7,12,8],[23,7,23,8],[28,7,28,8],[35,7,35,8],[46,7,46,8],[52,7,52,8],[35,11,35,12],[46,11,46,12],[12,9,12,10],[23,9,23,10],[28,9,28,10],[35,9,35,10],[46,9,46,10],[117,9,117,10],[123,9,123,10],[70,7,70,8],[76,7,76,8],[83,7,83,8],[94,7,94,8],[100,7,100,8],[107,7,107,8],[117,7,117,8],[117,11,117,12],[123,11,123,12],[12,13,12,14],[23,13,23,14],[28,13,28,14],[35,13,35,14],[46,13,46,14],[52,13,52,14],[59,13,59,14],[70,13,70,14],[76,13,76,14],[83,13,83,14],[94,13,94,14],[100,13,100,14],[107,13,107,14],[117,13,117,14],[76,11,76,12],[83,11,83,12],[94,11,94,12],[100,11,100,12],[107,11,107,12],[12,11,12,12],[23,11,23,12],[123,13,123,14],[12,15,12,16],[23,15,23,16],[28,15,28,16],[35,15,35,16],[46,15,46,16],[52,15,52,16],[59,15,59,16],[70,15,70,16],[76,15,76,16],[94,15,94,16],[100,15,100,16],[107,15,107,16],[117,15,117,16],[123,15,123,16],[100,17,100,18],[107,17,107,18],[117,17,117,18],[123,17,123,18],[59,17,59,18],[70,17,70,18],[76,17,76,18],[83,17,83,18],[94,17,94,18],[12,17,12,18],[23,17,23,18],[28,17,28,18],[12,19,12,20],[23,19,23,20],[28,19,28,20],[35,19,35,20],[46,19,46,20],[52,19,52,20],[59,19,59,20],[70,19,70,20],[76,19,76,20],[107,19,107,20],[117,19,117,20],[123,19,123,20],[12,21,12,22],[23,21,23,22],[28,21,28,22],[35,21,35,22],[46,21,46,22],[52,21,52,22],[59,21,59,22],[70,21,70,22],[76,21,76,22],[83,21,83,22],[94,21,94,22],[100,21,100,22],[107,21,107,22],[117,21,117,22],[123,21,123,22],[94,19,94,20],[100,19,100,20],[12,25,12,26],[23,25,23,26],[28,25,28,26],[35,25,35,26],[46,25,46,26],[52,25,52,26],[59,25,59,26],[70,25,70,26],[76,25,76,26],[83,25,83,26],[94,25,94,26],[100,25,100,26],[107,25,107,26],[117,25,117,26],[123,25,123,26],[28,23,28,24],[35,23,35,24],[46,23,46,24],[52,23,52,24],[59,23,59,24],[83,23,83,24],[94,23,94,24],[100,23,100,24],[107,23,107,24],[117,23,117,24],[123,23,123,24],[52,27,52,28],[59,27,59,28],[70,27,70,28],[76,27,76,28],[83,27,83,28],[12,27,12,28],[23,27,23,28],[28,27,28,28],[35,27,35,28],[46,27,46,28],[94,27,94,28],[100,27,100,28],[107,27,107,28],[117,27,117,28],[94,29,94,30],[100,29,100,30],[107,29,107,30],[117,29,117,30],[123,27,123,28],[123,29,123,30],[52,29,52,30],[59,29,59,30],[70,29,70,30],[76,29,76,30],[83,29,83,30],[12,29,12,30],[23,29,23,30],[28,29,28,30],[35,29,35,30],[46,29,46,30]]}
[]
[null,"Dados"]
[null,"Quantidade de proprietários (por cada direito)",4]
[null,"Tipo de Proprietários","Proprietário de Raiz e Direito de Superfície"]
[null,"Imóvel"]
[null,"Localidade","Porto"]
[null,"Finalidade do imóvel","Habitação secundária"]
[null,"Valor de venda do imóvel",180000]
[null,"Ano de venda",2025]
[]
[]
["Cálculo da mais valia"]
[null,"Proprietário 1",null,"Proprietário 2",null,"Proprietário 3 ",null,"Proprietário 4",null,"Proprietário 5",null,"Proprietário 6",null,"Proprietário 7",null,"Proprietário 8",null,"Proprietário 9",null,"Proprietário 10",null,"Proprietário 11",null,"Proprietário 12",null,"Proprietário 13",null,"Proprietário 14 ",null,"Proprietário 15"]
[null,"Nome","João","Nome","Maria",null,null,"Nome",null,"Nome",null,"Nome",null,"Nome",null,"Nome",null,"Nome",null,"Nome",null,"Nome",null,"Nome",null,"Nome",null,"Nome",null,"Nome"]
[null,"Idade",60,"Idade",55,"Idade",null,"Idade",null,"Idade",null,"Idade",null,"Idade",null,"Idade",null,"Idade",null,"Idade",null,"Idade",null,"Idade",null,"Idade",null,"Idade",null,"Idade"]
[{"$f":"SUM(INDEX(16:16, _xlfn.SEQUENCE(C3, , 3, 2)))","v":1},"Quota-parte do direito",0.5,"Quota-parte do direito",0.5,"Quota-parte do direito",null,"Quota-parte do direito",null,"Quota-parte do direito",null,"Quota-parte do direito",null,"Quota-parte do direito",null,"Quota-parte do direito",null,"Quota-parte do direito",null,"Quota-parte do direito",null,"Quota-parte do direito",null,"Quota-parte do direito",null,"Quota-parte do direito",null,"Quota-parte do direito",null,"Quota-parte do direito"]
[{"$f":"IF(A16<>100%, \"As percentagens dos proprietários não totalizam 100%, voltar a confirmar quotas de todos os proprietários\", \"\")","v":""},"Origem","Herança direta","Origem","Herança direta","Origem",null,"Origem",null,"Origem",null,"Origem",null,"Origem",null,"Origem",null,"Origem",null,"Origem",null,"Origem",null,"Origem",null,"Origem",null,"Origem",null,"Origem"]
[null,{"$f":"IF(C17=\"Herança direta\", \"Valor patrimonial\", IF(C17=\"Herança de terceiro\", \"Valor do imóvel na doação\", IF(C17=\"Aquisição\", \"Valor de aquisição\", \"\")))","v":"Valor patrimonial"},75000,{"$f":"IF(E17=\"Herança direta\", \"Valor patrimonial\", IF(E17=\"Herança de terceiro\", \"Valor do imóvel na doação\", IF(E17=\"Aquisição\", \"Valor de aquisição\", \"\")))","v":"Valor patrimonial"},75000,{"$f":"IF(G17=\"Herança direta\", \"Valor patrimonial\", IF(G17=\"Herança de terceiro\", \"Valor do imóvel na doação\", IF(G17=\"Aquisição\", \"Valor de aquisição\", \"\")))","v":""},null,{"$f":"IF(I17=\"Herança direta\", \"Valor patrimonial\", IF(I17=\"Herança de terceiro\", \"Valor do imóvel na doação\", IF(I17=\"Aquisição\", \"Valor de aquisição\", \"\")))","v":""},null,{"$f":"IF(K17=\"Herança direta\", \"Valor patrimonial\", IF(K17=\"Herança de terceiro\", \"Valor do imóvel na doação\", IF(K17=\"Aquisição\", \"Valor de aquisição\", \"\")))","v":""},null,{"$f":"IF(M17=\"Herança direta\", \"Valor patrimonial\", IF(M17=\"Herança de terceiro\", \"Valor do imóvel na doação\", IF(M17=\"Aquisição\", \"Valor de aquisição\", \"\")))","v":""},null,{"$f":"IF(O17=\"Herança direta\", \"Valor patrimonial\", IF(O17=\"Herança de terceiro\", \"Valor do imóvel na doação\", IF(O17=\"Aquisição\", \"Valor de aquisição\", \"\")))","v":""},null,{"$f":"IF(Q17=\"Herança direta\", \"Valor patrimonial\", IF(Q17=\"Herança de terceiro\", \"Valor do imóvel na doação\", IF(Q17=\"Aquisição\", \"Valor de aquisição\", \"\")))","v":""},null,{"$f":"IF(S17=\"Herança direta\", \"Valor patrimonial\", IF(S17=\"Herança de terceiro\", \"Valor do imóvel na doação\", IF(S17=\"Aquisição\", \"Valor de aquisição\", \"\")))","v":""},null,{"$f":"IF(U17=\"Herança direta\", \"Valor patrimonial\", IF(U17=\"Herança de terceiro\", \"Valor do imóvel na doação\", IF(U17=\"Aquisição\", \"Valor de aquisição\", \"\")))","v":""},null,{"$f":"IF(W17=\"Herança direta\", \"Valor patrimonial\", IF(W17=\"Herança de terceiro\", \"Valor do imóvel na doação\", IF(W17=\"Aquisição\", \"Valor de aquisição\", \"\")))","v":""},null,{"$f":"IF(Y17=\"Herança direta\", \"Valor patrimonial\", IF(Y17=\"Herança de terceiro\", \"Valor do imóvel na doação\", IF(Y17=\"Aquisição\", \"Valor de aquisição\", \"\")))","v":""},null,{"$f":"IF(AA17=\"Herança direta\", \"Valor patrimonial\", IF(AA17=\"Herança de terceiro\", \"Valor do imóvel na doação\", IF(AA17=\"Aquisição\", \"Valor de aquisição\", \"\")))","v":""},null,{"$f":"IF(AC17=\"Herança direta\", \"Valor patrimonial\", IF(AC17=\"Herança de terceiro\", \"Valor do imóvel na doação\", IF(AC17=\"Aquisição\", \"Valor de aquisição\", \"\")))","v":""},null,{"$f":"IF(AE17=\"Herança direta\", \"Valor patrimonial\", IF(AE17=\"Herança de terceiro\", \"Valor do imóvel na doação\", IF(AE17=\"Aquisição\", \"Valor de aquisição\", \"\")))","v":""}]
[null,"Ano de aquisição",2013,"Ano de aquisição",2013,"Ano de aquisição",null,"Ano de aquisição",null,"Ano de aquisição",null,"Ano de aquisição",null,"Ano de aquisição",null,"Ano de aquisição",null,"Ano de aquisição",null,"Ano de aquisição",null,"Ano de aquisição",null,"Ano de aquisição",null,"Ano de aquisição",null,"Ano de aquisição",null,"Ano de aquisição"]
[null,"Obras nos últimos 12 anos",15000,"Obras nos últimos 12 anos",0,"Obras nos últimos 12 anos",null,"Obras nos últimos 12 anos",null,"Obras nos últimos 12 anos",null,"Obras nos últimos 12 anos",null,"Obras nos últimos 12 anos",null,"Obras nos últimos 12 anos",null,"Obras nos últimos 12 anos",null,"Obras nos últimos 12 anos",null,"Obras nos últimos 12 anos",null,"Obras nos últimos 12 anos",null,"Obras nos últimos 12 anos",null,"Obras nos últimos 12 anos",null,"Obras nos últimos 12 anos"]
[null,"Impostos pagos na aquisição",3000,"Impostos pagos na aquisição",3000,"Impostos pagos na aquisição",null,"Impostos pagos na aquisição",null,"Impostos pagos na aquisição",null,"Impostos pagos na aquisição",null,"Impostos pagos na aquisição",null,"Impostos pagos na aquisição",null,"Impostos pagos na aquisição",null,"Impostos pagos na aquisição",null,"Impostos pagos na aquisição",null,"Impostos pagos na aquisição",null,"Impostos pagos na aquisição",null,"Impostos pagos na aquisição",null,"Impostos pagos na aquisição"]
[null,"Comissão imobiliária",5000,"Comissão imobiliária",5000,"Comissão imobiliária",null,"Comissão imobiliária",null,"Comissão imobiliária",null,"Comissão imobiliária",null,"Comissão imobiliária",null,"Comissão imobiliária",null,"Comissão imobiliária",null,"Comissão imobiliária",null,"Comissão imobiliária",null,"Comissão imobiliária",null,"Comissão imobiliária",null,"Comissão imobiliária",null,"Comissão imobiliária"]
[null,"Outros encargos dedutíveis",0,"Outros encargos dedutíveis",0,"Outros encargos dedutíveis",null,"Outros encargos dedutíveis",null,"Outros encargos dedutíveis",null,"Outros encargos dedutíveis",null,"Outros encargos dedutíveis",null,"Outros encargos dedutíveis",null,"Outros encargos dedutíveis",null,"Outros encargos dedutíveis",null,"Outros encargos dedutíveis",null,"Outros encargos dedutíveis",null,"Outros encargos dedutíveis",null,"Outros encargos dedutíveis",null,"Outros encargos dedutíveis"]
[null,"Cálculo da mais valia",null,"Cálculo da mais valia",null,"Cálculo da mais valia",null,"Cálculo da mais valia",null,"Cálculo da mais valia",null,"Cálculo da mais valia",null,"Cálculo da mais valia",null,"Cálculo da mais valia",null,"Cálculo da mais valia",null,"Cálculo da mais valia",null,"Cálculo da mais valia",null,"Cálculo da mais valia",null,"Cálculo da mais valia",null,"Cálculo da mais valia",null,"Cálculo da mais valia"]
[null,"Coeficiente de atualização",{"$f":"VLOOKUP(C19, 'Coeficiente de atualização'!B2:C154, 2, FALSE)","v":1.17},"Coeficiente de atualização",{"$f":"VLOOKUP(E19, 'Coeficiente de atualização'!$B$2:$C$154, 2, FALSE)","v":1.17},"Coeficiente de atualização",{"$f":"VLOOKUP(G19, 'Coeficiente de atualização'!$B$2:$C$154, 2, FALSE)","v":{"$error":"#N/A"}},"Coeficiente de atualização",{"$f":"VLOOKUP(I19, 'Coeficiente de atualização'!$B$2:$C$154, 2, FALSE)","v":{"$error":"#N/A"}},"Coeficiente de atualização",{"$f":"VLOOKUP(K19, 'Coeficiente de atualização'!$B$2:$C$154, 2, FALSE)","v":{"$error":"#N/A"}},"Coeficiente de atualização",{"$f":"VLOOKUP(M19, 'Coeficiente de atualização'!$B$2:$C$154, 2, FALSE)","v":{"$error":"#N/A"}},"Coeficiente de atualização",{"$f":"VLOOKUP(O19, 'Coeficiente de atualização'!$B$2:$C$154, 2, FALSE)","v":{"$error":"#N/A"}},"Coeficiente de atualização",{"$f":"VLOOKUP(Q19, 'Coeficiente de atualização'!$B$2:$C$154, 2, FALSE)","v":{"$error":"#N/A"}},"Coeficiente de atualização",{"$f":"VLOOKUP(S19, 'Coeficiente de atualização'!$B$2:$C$154, 2, FALSE)","v":{"$error":"#N/A"}},"Coeficiente de atualização",{"$f":"VLOOKUP(U19, 'Coeficiente de atualização'!$B$2:$C$154, 2, FALSE)","v":{"$error":"#N/A"}},"Coeficiente de atualização",{"$f":"VLOOKUP(W19, 'Coeficiente de atualização'!$B$2:$C$154, 2, FALSE)","v":{"$error":"#N/A"}},"Coeficiente de atualização",{"$f":"VLOOKUP(Y19, 'Coeficiente de atualização'!$B$2:$C$154, 2, FALSE)","v":{"$error":"#N/A"}},"Coeficiente de atualização",{"$f":"VLOOKUP(AA19, 'Coeficiente de atualização'!$B$2:$C$154, 2, FALSE)","v":{"$error":"#N/A"}},"Coeficiente de atualização",{"$f":"VLOOKUP(AC19, 'Coeficiente de atualização'!$B$2:$C$154, 2, FALSE)","v":{"$error":"#N/A"}},"Coeficiente de atualização",{"$f":"VLOOKUP(AE19, 'Coeficiente de atualização'!$B$2:$C$154, 2, FALSE)","v":{"$error":"#N/A"}}]
[null,"Despesas e encargos",{"$f":"C20+C21+C22+C23","v":23000},"Despesas e encargos",{"$f":"E20+E21+E22+E23","v":8000},"Despesas e encargos",{"$f":"G20+G21+G22+G23","v":0},"Despesas e encargos",{"$f":"I20+I21+I22+I23","v":0},"Despesas e encargos",{"$f":"K20+K21+K22+K23","v":0},"Despesas e encargos",{"$f":"M20+M21+M22+M23","v":0},"Despesas e encargos",{"$f":"O20+O21+O22+O23","v":0},"Despesas e encargos",{"$f":"Q20+Q21+Q22+Q23","v":0},"Despesas e encargos",{"$f":"S20+S21+S22+S23","v":0},"Despesas e encargos",{"$f":"U20+U21+U22+U23","v":0},"Despesas e encargos",{"$f":"W20+W21+W22+W23","v":0},"Despesas e encargos",{"$f":"Y20+Y21+Y22+Y23","v":0},"Despesas e encargos",{"$f":"AA20+AA21+AA22+AA23","v":0},"Despesas e encargos",{"$f":"AC20+AC21+AC22+AC23","v":0},"Despesas e encargos",{"$f":"AE20+AE21+AE22+AE23","v":0}]
[null,"Mais-valia",{"$f":"(C8-(C18*C25)-C26)*C16","v":34625},"Mais-valia",{"$f":"($C$8-(E18*E25)-E26)*E16","v":42125},"Mais-valia",{"$f":"($C$8-(G18*G25)-G26)*G16","v":{"$error":"#N/A"}},"Mais-valia",{"$f":"($C$8-(I18*I25)-I26)*I16","v":{"$error":"#N/A"}},"Mais-valia",{"$f":"($C$8-(K18*K25)-K26)*K16","v":{"$error":"#N/A"}},"Mais-valia",{"$f":"($C$8-(M18*M25)-M26)*M16","v":{"$error":"#N/A"}},"Mais-valia",{"$f":"($C$8-(O18*O25)-O26)*O16","v":{"$error":"#N/A"}},"Mais-valia",{"$f":"($C$8-(Q18*Q25)-Q26)*Q16","v":{"$error":"#N/A"}},"Mais-valia",{"$f":"($C$8-(S18*S25)-S26)*S16","v":{"$error":"#N/A"}},"Mais-valia",{"$f":"($C$8-(U18*U25)-U26)*U16","v":{"$error":"#N/A"}},"Mais-valia",{"$f":"($C$8-(W18*W25)-W26)*W16","v":{"$error":"#N/A"}},"Mais-valia",{"$f":"($C$8-(Y18*Y25)-Y26)*Y16","v":{"$error":"#N/A"}},"Mais-valia",{"$f":"($C$8-(AA18*AA25)-AA26)*AA16","v":{"$error":"#N/A"}},"Mais-valia",{"$f":"($C$8-(AC18*AC25)-AC26)*AC16","v":{"$error":"#N/A"}},"Mais-valia",{"$f":"($C$8-(AE18*AE25)-AE26)*AE16","v":{"$error":"#N/A"}}]
[null,"Art 43º (50%)",{"$f":"C27/2","v":17312.5},"Art 43º (50%)",{"$f":"E27/2","v":21062.5},"Art 43º (50%)",{"$f":"G27/2","v":{"$error":"#N/A"}},"Art 43º (50%)",{"$f":"I27/2","v":{"$error":"#N/A"}},"Art 43º (50%)",{"$f":"K27/2","v":{"$error":"#N/A"}},"Art 43º (50%)",{"$f":"M27/2","v":{"$error":"#N/A"}},"Art 43º (50%)",{"$f":"O27/2","v":{"$error":"#N/A"}},"Art 43º (50%)",{"$f":"Q27/2","v":{"$error":"#N/A"}},"Art 43º (50%)",{"$f":"S27/2","v":{"$error":"#N/A"}},"Art 43º (50%)",{"$f":"U27/2","v":{"$error":"#N/A"}},"Art 43º (50%)",{"$f":"W27/2","v":{"$error":"#N/A"}},"Art 43º (50%)",{"$f":"Y27/2","v":{"$error":"#N/A"}},"Art 43º (50%)",{"$f":"AA27/2","v":{"$error":"#N/A"}},"Art 43º (50%)",{"$f":"AC27/2","v":{"$error":"#N/A"}},"Art 43º (50%)",{"$f":"AE27/2","v":{"$error":"#N/A"}}]
[null,"Dados pessoais",null,"Dados pessoais",null,"Dados pessoais",null,"Dados pessoais",null,"Dados pessoais",null,"Dados pessoais",null,"Dados pessoais",null,"Dados pessoais",null,"Dados pessoais",null,"Dados pessoais",null,"Dados pessoais",null,"Dados pessoais",null,"Dados pessoais",null,"Dados pessoais",null,"Dados pessoais"]
[null,"Rendimento anual coletável",30000,"Rendimento anual coletável",30000,"Rendimento anual coletável",30000,"Rendimento anual coletável",30000,"Rendimento anual coletável",30000,"Rendimento anual coletável",30000,"Rendimento anual coletável",null,"Rendimento anual coletável",null,"Rendimento anual coletável",null,"Rendimento anual coletável",null,"Rendimento anual coletável",null,"Rendimento anual coletável",null,"Rendimento anual coletável",null,"Rendimento anual coletável",null,"Rendimento anual coletável"]
{"$rows_left_out":100}
{"sheet":"Tabelas IRS","index":1,"n_rows":12,"n_cols":4,"rows_kept":12,"cut":false,"hidden":false,"merged":[[0,0,0,3],[1,0,1,3]]}
["IRS - Trabalhador, não casado, sem dependentes, em Portugal Continental"]
["IRS"]
["Limite mínimo","F (Limite Máximo)","G (Taxa)","H (Parcela)"]
[0,8059,0.13,0]
[8059.01,12160,0.16500000000000001,282.07]
[12160.01,17233,0.22,950.91]
[17233.009999999998,22306,0.25,1467.91]
[22306.01,28400,0.32,3029.38]
[28400.01,41629,0.35499999999999998,4023.14]
[41629.01,44987,0.435,7353.76]
[44987.01,83696,0.45,8028.38]
[83696.009999999995,999999999,0.48,10539]

{"sheet":"Coeficiente de atualização","index":2,"n_rows":123,"n_cols":3,"rows_kept":123,"cut":false,"hidden":false,"merged":[]}
[]
[null,"Anos","Coeficientes"]
[null,"Até 1903",5463.93]
[null,1904,5086.29]
[null,1905,5086.29]
[null,1906,5086.29]
[null,1907,5086.29]
[null,1908,5086.29]
[null,1909,5086.29]
[null,1910,5086.29]
[null,1911,4878.32]
[null,1912,4878.32]
[null,1913,4878.32]
[null,1914,4878.32]
[null,1915,4340.22]
[null,1916,3552.49]
[null,1917,2835.94]
[null,1918,2023.36]
[null,1919,1550.68]
[null,1920,1024.6199999999999]
[null,1921,668.53]
[null,1922,495.1]
[null,1923,302.98]
[null,1924,255.06]
[null,1925,219.83]
[null,1926,219.83]
[null,1927,219.83]
[null,1928,219.83]
[null,1929,219.83]
[null,1930,219.83]
{"$rows_left_out":94}
{"sheet":"Art 13 CIMT","index":3,"n_rows":12,"n_cols":4,"rows_kept":12,"cut":false,"hidden":false,"merged":[]}
[]
["Intervalo","Idade do usufrutuário","Valor do Usufruto (%)","Valor da Nua Propriedade (%)"]
["0 a 20 anos",0,0.9,0.1]
["20 a 30 anos",20,0.85,0.15]
["30 a 40 anos",30,0.8,0.2]
["40 a 50 anos",40,0.7,0.3]
["50 a 60 anos",50,0.6,0.4]
["60 a 65 anos",60,0.5,0.5]
["65 a 70 anos",65,0.4,0.6]
["70 a 75 anos",70,0.3,0.7]
["75 a 80 anos",75,0.2,0.8]
["Mais de 80 anos",999,0.1,0.9]

{"sheet":"Backup","index":4,"n_rows":22,"n_cols":6,"rows_kept":22,"cut":false,"hidden":true,"merged":[]}
[]
[]
[]
[]
[]
["Direito","Usufruto","Direito","Nua Propriedade","Direito","Usufruto"]
["Quota-parte do direito",0.5,"Quota-parte do direito",0.5,"Quota-parte do direito",0.5]
["Origem","Herança de terceiro","Origem","Herança de terceiro","Origem","Herança de terceiro"]
["Valor do imóvel na doação",40000,"Valor do imóvel na doação",40000,"Valor do imóvel na doação",40000]
["Ano de aquisição",1990,"Ano de aquisição",1990,"Ano de aquisição",2013]
["Obras nos últimos 12 anos",0,"Obras nos últimos 12 anos",5000,"Obras nos últimos 12 anos",0]
["Impostos pagos na aquisição",100,"Impostos pagos na aquisição",100,"Impostos pagos na aquisição",100]
["Outros encargos dedutíveis",0,"Outros encargos dedutíveis",0,"Outros encargos dedutíveis",0]
[]
["Coeficiente de atualização",2.63,"Coeficiente de atualização",2.63,"Coeficiente de atualização",1.17]
["Despesas e encargos",100,"Despesas e encargos",5100,"Despesas e encargos",100]
["Percentagem atribuída do direito",null,"Percentagem atribuída",null,"Percentagem atribuída"]
["Quota-parte da mais-valia",null,"Mais-valia",null,"Mais-valia"]
[]
[]
["Finalidade do imóvel","Habitação secundária","Finalidade do imóvel","Habitação secundária","Finalidade do imóvel","Habitação secundária"]
["Rendimento anual coletável",null,"Rendimento anual coletável",null,"Rendimento anual coletável"]